0061400-> 0061450 CTX – Context file errors

0061400 "%s":NON-NUMERIC VALUE

Type: CTX0

 

0061401 "%s":THE VALUE IS OUTSIDE THE RANGE "%ld"-"%ld"

Type: CTX0

 

0061402 "%s":UNAUTHORIZED VALUE

Type: CTX0

 

0061404 FAILED TO OPEN FILE "%s"

Type: CTX0

 

0061406 FILE "%s" DOES NOT EXIST

Type: CTX0

 

0061407 "%s", LINE "%d": LINE TOO LONG

Type: CTX0

 

0061408 "%s", LINE "%d": THE KEYWORD IS UNKNOWN IN THE SECTION

Type: CTX0

 

0061410 INCONSISTENCY DETECTED

Type: CTX0

 

0061411 MEM0MEMORY ALLOCATION FAILURE

 

0061412 "%s": THE VALUE IS TOO LONG (MAX:"%d" CHAR)

Type: CTX0

 

0061413 "%s" LINE READ FAILURE

Type: I/O0

 

0061414 "%s", LINE "%d":THE SECTION DECLARATION IS INCORRECT

Type: CTX0

 

0061415 >"%s"<."%s" NOT DEFINED

Type: CTX0

 

0061415 IN SECTION "%s" KEYWORD "%s" IS MISSING

Type: CTX0

 

0061416 "%s": AN ALPHANUMERIC OR UNDERSCORED VALUE IS EXPECTED

Type: CTX0

 

0061417 "%s": AN ALPHANUMERIC VALUE IS EXPECTED

Type: CTX0

 

0061418 "%s": MM/DD/YYYY DATE STRUCTURE EXPECTED

Type: CTX0

 

0061419 "%s": DATE NOT SCHEDULED

Type: CTX0

 

0061421 "%s": A COMPLETE FILE PATH WITH AN EXISTING DIRECTORY IS EXPECTED

Type: CTX0

 

0061422 "%s": A COMPLETE FILE PATH WITH AN EXISTING DIRECTORY IS EXPECTED

Type: CTX0

 

0061424 "%s", LINE "%d": LINE OF MORE THAN "%d" CHARACTERS OR END OF LINE MISSING

Type: CTX0

 

0061425 DEBUG:("%s") KEYWORD SECTION "%d" IS FALSE

Type: CTX0

 

0061426 DEBUG:("%s") THE POST CHECKED KEYWORD "%d" IS FALSE

Type: CTX0

 

0061427 DEBUG:("%s") KEYWORD TYPE "%d" IS FALSE

Type: CTX0

 

0061428 DEBUG:("%s") THE KEYWORD TYPE AND CHECK "%d" ARE INCOMPATIBLE

Type: CTX0

 

0061429 DEBUG:("%s") THE CHECKED KEYWORD "%d" IS FALSE

Type: CTX0

 

0061430 DEBUG:("%s") THE CHECKED VALUE "%d" IS FALSE

Type: CTX0

 

0061431 DEBUG:("%s") CHECKED TYPE "%d" IS FALSE

Type: CTX0

 

0061432 DEBUG:("%s") THE IF THEN BRANCH "%d" CHECKED IS FALSE

Type: CTX0

 

0061433 DEBUG:("%s") THE ELSE BRANCH CHECKED "%d" IS FALSE

Type: CTX0

 

0061434 DEBUG:("%s") INFINITE LOOP ON KEYWORD CHECK "%d"

Type: CTX0

 

0061435 DEBUG:("%s") THE CHECKS ON THESE KEYWORDS ARE INTERDEPENDENT

Type: CTX0

 

0061436 SECTION: "%s" KEYWORD: "%s"

Type: CTX0

 

0061436 CYCLICAL DEPENDENCY BETWEEN KEYWORDS SECTION: "%s" KEYWORD: "%s"

Type: CTX0

 

0061437 "%s": THE VALUE IS TOO SHORT (MIN: "%d" CHAR)

Type: CTX0

 

0061438 "%s": A NON ALPHANUMERIC VALUE IS EXPECTED

Type: CTX0

 

0061439 "%s": AN ALPHABETICAL VALUE IS EXPECTED

Type: CTX0

 

0061440 DEBUG:("%s") TYPE \"%s"\ INCORRECTLY FORMED

Type: CTX0

 

0061441 DEBUG:("%s") THE TYPE LISTED \"%s"\ CONTAINS INDICES NOT PRESENT IN THE STRING TABLE

Type: CTX0

 

0061442 DEBUG:ONLY DATA TYPE C IS EXPECTED

Type: CTX0

 

0061443 DEBUG: "%s" IS A DIRECTORY

Type: CTX0

 

0061444 DEBUG:("%s") THE INDEX SECTIONS "%d" AND "%d" HAVE THE SAME NAME

Type: CTX0

 

0061445 DEBUG:("%s") THE INDEX KEYWORDS "%d" AND "%d" HAVE THE SAME NAME

Type: CTX0

 

0061446 "%s" L"%d" ,THE '' SYMBOL IS MISSING FROM THE END OF THE STRING

Type: CTX0

 

0061447 "%s" ,THE EXPECTED CHARACTER STRING IS BETWEEN TWO ''

Type: CTX0

 

0061448 "%s" ,SECTION "%c"%s%c" DOES NOT EXIST

Type: CTX0

 

0061449 FILE STRUCTURE "%s" IS INCORRECT.

Type: CTX0

 

0061450 "%s" L"%d" , THE KEYWORD VALUE MUST BE DEFINED

Type: CTX0

Related Links